UPGRADE YOUR BROWSER

We have detected your current browser version is not the latest one. Xilinx.com uses the latest web technologies to bring you the best online experience possible. Please upgrade to a Xilinx.com supported browser:Chrome, Firefox, Internet Explorer 11, Safari. Thank you!

cancel
Showing results for 
Search instead for 
Did you mean: 
Highlighted
2,084 Views
Registered: ‎08-21-2013

Zedboard & SDK tutorial - wont build.

Trying to bulid the attached tutorial for the Zeboard. Using version 14.4 tools. The SDK can't seem to find th libraries.

 

I've tried versions 14.2, 14.4 and 14.6.

 

Is this a license issue?  I should have all full licenses. 

 

 

 

make -k all
libgen -hw ../system_hw_platform/system.xml\
\
-pe ps7_cortexa9_0 \
-log libgen.log \
system.mss
libgen
Xilinx EDK 14.4 Build EDK_P.49d
Copyright (c) 1995-2012 Xilinx, Inc. All rights reserved.

Command Line: libgen -hw ../system_hw_platform/system.xml -pe ps7_cortexa9_0
-log libgen.log system.mss


Staging source files.
Running DRCs.
Running generate.
Running post_generate.
Running include - 'make -s include "COMPILER=arm-xilinx-eabi-gcc"
"ARCHIVER=arm-xilinx-eabi-ar" "COMPILER_FLAGS= -O2 -c"
"EXTRA_COMPILER_FLAGS=-g"'.

Running libs - 'make -s libs "COMPILER=arm-xilinx-eabi-gcc"
"ARCHIVER=arm-xilinx-eabi-ar" "COMPILER_FLAGS= -O2 -c"
"EXTRA_COMPILER_FLAGS=-g"'.
"Compiling xadc"
process_begin: CreateProcess(NULL, arm-xilinx-eabi-gcc -O2 -c -g -I./. -I../../../include *.c, ...) failed.
make (e=2): The system cannot find the file specified.

make[1]: *** [libs] Error 2
"Compiling standalone"
process_begin: CreateProcess(NULL, arm-xilinx-eabi-gcc -O2 -c -g -march=armv7-a -mfloat-abi=soft -mfpu=neon -I./. -I../../../include _exit.c _open.c _sbrk.c abort.c close.c errno.c fcntl.c fstat.c getpid.c inbyte.c isatty.c kill.c lseek.c open.c outbyte.c print.c putnum.c read.c sbrk.c sleep.c smc.c uart.c unlink.c usleep.c vectors.c write.c xil_assert.c xil_cache.c xil_exception.c xil_io.c xil_mmu.c xil_printf.c xil_testcache.c xil_testio.c xil_testmem.c xl2cc_counter.c xpm_counter.c xtime_l.c asm_vectors.S boot.S cpu_init.S translation_table.s xil-crt0.S, ...) failed.
"Compiling devcfg"
make (e=2): The system cannot find the file specified.
"Compiling dmaps"

make[1]: *** [standalone_libs] Error 2
make[1]: Target `libs' not remade because of errors.
process_begin: CreateProcess(NULL, arm-xilinx-eabi-gcc -O2 -c -g -I./. -I../../../include *.c, ...) failed.
make (e=2): The system cannot find the file specified.

make[1]: *** [libs] Error 2
process_begin: CreateProcess(NULL, arm-xilinx-eabi-gcc -O2 -c -g -I./. -I../../../include *.c, ...) failed.
make (e=2): The system cannot find the file specified.

make[1]: *** [libs] Error 2
"Compiling scugic"
process_begin: CreateProcess(NULL, arm-xilinx-eabi-gcc -O2 -c -g -I./. -I../../../include *.c, ...) failed.
make (e=2): The system cannot find the file specified.

make[1]: *** [libs] Error 2
"Compiling scutimer"
process_begin: CreateProcess(NULL, arm-xilinx-eabi-gcc -O2 -c -g -I./. -I../../../include *.c, ...) failed.
make (e=2): The system cannot find the file specified.

make[1]: *** [libs] Error 2
"Compiling scuwdt"
process_begin: CreateProcess(NULL, arm-xilinx-eabi-gcc -O2 -c -g -I./. -I../../../include *.c, ...) failed.
make (e=2): The system cannot find the file specified.

make[1]: *** [libs] Error 2
"Compiling uartps"
process_begin: CreateProcess(NULL, arm-xilinx-eabi-gcc -O2 -c -g -I./. -I../../../include *.c, ...) failed.
make (e=2): The system cannot find the file specified.

make[1]: *** [libs] Error 2
"Compiling cpu_cortexa9"
ERROR:EDK:369 - make failed for target "libs"
ERROR:EDK:3418 - Error(s) while running make.
make: *** [ps7_cortexa9_0/lib/libxil.a] Error 2
make: Target `all' not remade because of errors.

0 Kudos