UPGRADE YOUR BROWSER

We have detected your current browser version is not the latest one. Xilinx.com uses the latest web technologies to bring you the best online experience possible. Please upgrade to a Xilinx.com supported browser:Chrome, Firefox, Internet Explorer 11, Safari. Thank you!

cancel
Showing results for 
Search instead for 
Did you mean: 
Highlighted
651 Views
Registered: ‎01-10-2018

Petalinux build TRD 2017.2 failed

Hi I am building TRD 2017.2 for ZCU106. I have followed instructions mentioned in 

Zynq_UltraScale _MPSoC_VCU_Targeted_Reference_design_ea_2017.2.pdf. I am getting following error :

 

cd Source/ && ( test -e Makefile.QtWebKit || /home/pranaykumark/projects/zync_eval_board/projects/trd/vcu_petalinux_bsp/sysroots/x86_64-linux/usr/bin/qt5/qmake /home/pranaykumark/projects/zync_eval_board/projects/trd/vcu_petalinux_bsp/work/aarch64-xilinx-linux/qtwebkit/5.7.1+gitAUTOINC+76e2732f01-r0/git/Source/QtWebKit.pro QMAKE_CFLAGS+=-g0 QMAKE_CXXFLAGS+=-g0 -o Makefile.QtWebKit ) && make -f Makefile.QtWebKit
| make[1]: Entering directory '/home/pranaykumark/projects/zync_eval_board/projects/trd/vcu_petalinux_bsp/work/aarch64-xilinx-linux/qtwebkit/5.7.1+gitAUTOINC+76e2732f01-r0/build/Source'
| ( test -e Makefile.api || /home/pranaykumark/projects/zync_eval_board/projects/trd/vcu_petalinux_bsp/sysroots/x86_64-linux/usr/bin/qt5/qmake /home/pranaykumark/projects/zync_eval_board/projects/trd/vcu_petalinux_bsp/work/aarch64-xilinx-linux/qtwebkit/5.7.1+gitAUTOINC+76e2732f01-r0/git/Source/api.pri QMAKE_CFLAGS+=-g0 QMAKE_CXXFLAGS+=-g0 -o Makefile.api ) && make -f Makefile.api
| ERROR: oe_runmake failed
| make[2]: Entering directory '/home/pranaykumark/projects/zync_eval_board/projects/trd/vcu_petalinux_bsp/work/aarch64-xilinx-linux/qtwebkit/5.7.1+gitAUTOINC+76e2732f01-r0/build/Source'
| rm -f libQt5WebKit.so.5.7.0 libQt5WebKit.so libQt5WebKit.so.5 libQt5WebKit.so.5.7
| linking ../lib/libQt5WebKit.so.5.7.0
| /home/pranaykumark/projects/zync_eval_board/projects/trd/vcu_petalinux_bsp/sysroots/x86_64-linux/usr/bin/aarch64-xilinx-linux/aarch64-xilinx-linux-ld.gold: internal error in make_view, at ../../gold/fileread.cc:474
| collect2: error: ld returned 1 exit status
| make[2]: *** [Makefile.api:94: ../lib/libQt5WebKit.so.5.7.0] Error 1
| make[2]: Leaving directory '/home/pranaykumark/projects/zync_eval_board/projects/trd/vcu_petalinux_bsp/work/aarch64-xilinx-linux/qtwebkit/5.7.1+gitAUTOINC+76e2732f01-r0/build/Source'
| make[1]: *** [Makefile.QtWebKit:45: sub-api-pri-make_first-ordered] Error 2
| make[1]: Leaving directory '/home/pranaykumark/projects/zync_eval_board/projects/trd/vcu_petalinux_bsp/work/aarch64-xilinx-linux/qtwebkit/5.7.1+gitAUTOINC+76e2732f01-r0/build/Source'
| make: *** [Makefile:352: sub-Source-QtWebKit-pro-make_first-ordered] Error 2
| WARNING: /home/pranaykumark/projects/zync_eval_board/projects/trd/vcu_petalinux_bsp/work/aarch64-xilinx-linux/qtwebkit/5.7.1+gitAUTOINC+76e2732f01-r0/temp/run.do_compile.12774:1 exit 1 from 'exit 1'
| ERROR: Function failed: do_compile (log file is located at /home/pranaykumark/projects/zync_eval_board/projects/trd/vcu_petalinux_bsp/work/aarch64-xilinx-linux/qtwebkit/5.7.1+gitAUTOINC+76e2732f01-r0/temp/log.do_compile.12774)
ERROR: Task (/home/pranaykumark/projects/zync_eval_board/petalinux_17_2/components/yocto/source/aarch64/layers/meta-qt5/recipes-qt/qt5/qtwebkit_git.bb:do_compile) failed with exit code '1'
NOTE: Tasks Summary: Attempted 6145 tasks of which 6144 didn't need to be rerun and 1 failed.

Summary: 1 task failed:
/home/pranaykumark/projects/zync_eval_board/petalinux_17_2/components/yocto/source/aarch64/layers/meta-qt5/recipes-qt/qt5/qtwebkit_git.bb:do_compile
Summary: There were 2 ERROR messages shown, returning a non-zero exit code.
ERROR: Failed to build project

 

I am attaching the log file mentioned in the prints. Can you please help me in solving above issue

 

Regards,

Pranay kumar

0 Kudos